Execution failed for task ':core:cargoBuildArm'. > A problem occurred starting process 'command 'rustc''

Task :generateLinkerWrapper UP-TO-DATE
Task :core:cargoBuildArm FAILED
Task :mobile:mergeExtDexDebug

FAILURE: Build failed with an exception.

  • What went wrong:
    Execution failed for task ‘:core:cargoBuildArm’.

A problem occurred starting process ‘command ‘rustc’’

  • Try:
    Run with --stacktrace option to get the stack trace. Run with --info or --debug option to get more log output. Run with --scan to get full insights.

  • Get more help at https://help.gradle.org

Deprecated Gradle features were used in this build, making it incompatible with Gradle 7.0.
Use ‘–warning-mode all’ to show the individual deprecation warnings.
See Command-Line Interface

BUILD FAILED in 7m 37s
60 actionable tasks: 8 executed, 52 up-to-date

:roll_eyes: :face_with_head_bandage: ?