Build failed-clang++: error: unknown argument: '-nostdlib++'


#1

clang++: error: unknown argument: ‘-nostdlib++’
make: *** [/Users/jiesmart/Desktop/shadowsocks-android/core/build/intermediates/ndkBuild/debug/obj/local/x86/libss-local.so] Error 1